{"text_format":"1","workbook":"xlsx","n_sheets":3,"sheets":[" ","Validation","Source"],"not_rendered":{"charts":0,"images":1,"macros":1,"external_links":0,"defined_names":30,"comments":1,"pivot_tables":0},"unopened":[],"bounds":{"document_bytes":16777216,"sheet_cells":100000,"rows_first":2000,"rows_last":500,"rows_between":2000,"halvings":0,"cell_chars":16384,"cell_head_chars":4096},"cells_cut":0,"cells_raw":0,"read":"whole","date_system":"1900"}

{"sheet":" ","index":0,"n_rows":62,"n_cols":46,"rows_kept":62,"cut":false,"hidden":false,"merged":[[0,35,0,44],[28,14,28,17],[10,14,10,17],[11,14,11,17],[12,14,12,17],[5,15,5,17],[25,14,25,17],[21,14,23,17],[24,14,24,17],[0,26,0,29],[54,10,54,11],[55,10,55,11],[61,10,61,11],[56,10,56,11],[57,10,57,11],[58,10,58,11],[59,10,59,11],[60,10,60,11],[49,10,49,11],[50,10,50,11],[51,10,51,11],[52,10,52,11],[53,10,53,11],[44,10,44,11],[45,10,45,11],[46,10,46,11],[47,10,47,11],[48,10,48,11],[41,10,41,11],[31,10,31,11],[25,10,25,11],[36,10,36,11],[29,10,29,11],[30,10,30,11],[32,10,32,11],[33,10,33,11],[34,10,34,11],[16,10,16,11],[17,10,17,11],[10,10,10,11],[21,10,21,11],[11,10,11,11],[12,10,12,11],[13,10,13,11],[14,10,14,11],[15,10,15,11],[18,10,18,11],[20,10,20,11],[19,10,19,11],[22,10,22,11],[40,14,40,17],[42,14,42,17],[56,14,56,17],[37,10,37,11],[35,10,35,11],[28,10,28,11],[26,10,26,11],[27,10,27,11],[23,10,23,11],[43,10,43,11],[42,10,42,11],[24,10,24,11],[38,10,38,11],[39,10,39,11],[40,10,40,11],[57,14,57,17],[46,14,48,17],[26,14,27,17],[0,14,1,18],[3,15,3,17],[9,15,9,17],[19,14,20,17],[13,14,13,17],[14,14,14,17],[15,14,16,17],[17,14,18,17],[29,14,32,17]]}
[null,null,null,null,null,null,null,null,null,null,"Weekly Timesheet",null,null,null,"By signing this timesheet I certify that I have carefully reviewed this timesheet and that the hours reported on this timesheet, including all dates, start and stop times, activity type, tasks, work locations and comments, are accurate. ",null,null,null,null,null,null,null,null,null,null,null,{"$f":"IF(+PassFail=\"F\",(PassFail&_&User_Name&_&WeekEnding&_&\"TH\"&_&Total_hours&_&\"NH\"&_&Normal_Hrs&_&\"C19H\"&_&COVID19Hrs&_&\"OH\"&_&OtherHrs&_&\"C\"&_&J9&_&+L6&_&L10&_&P8&_&Validation!M10&_&Validation!M17&_),(User_Name&_&WeekEnding&_&\"TH\"&_&Total_hours&_&\"NH\"&_&Normal_Hrs&_&\"C19H\"&_&COVID19Hrs&_&\"OH\"&_&OtherHrs&_&\"C\"&_&J9&_&+L6&_&L10&_&P8&_&Validation!M10&_&Validation!M17&_))","v":"F___TH_0_NH_0_C19H_0_OH_0_C_0_Fail_Pass_Fail_0_0_"},null,null,null,null,null,null,null,null,"Timesheet successfully saved",null,null,null,null,null,null,null,null,null,"Click Here to Return to Timesheet"]
[null,null,null,null,null,null,null,null,null,null,"Week Start Date",{"$f":"+L3-6","v":-6}]
[null,"©  2020 IEM. All Rights Reserved. (5/07/2020)",null,null,null,null,null,null,null,null,"Week End Date"]
[null,"User Name",null,null,null,null,null,null,null,null,"Total Hours",{"$f":"ROUND(SUM(E12:E2000),2)","v":0}]
[null,"Employee Name",{"$f":"IFERROR(VLOOKUP($C$4,Source!$B$2:$W993,15,FALSE),\"\")","v":""},null,null,null,null,null,null,{"$f":"IF(VLOOKUP(WeekEnding,Validation!$B$2:$C$1992,2,FALSE)=\"No\",1,2)","v":{"$error":"#N/A"}},"Expected Total Hours",{"$f":"IFERROR(INDEX(Source!$V$2:$W$1992,MATCH(User_Name,Source!$B$2:$B$1992,0),+J5),\"\")","v":""}]
[null,"Assigned Location",{"$f":"IFERROR(VLOOKUP($C$4,Source!$B$2:$W993,9,FALSE),\"\")","v":""},null,null,null,null,null,null,null,"Expected Total Hours = Total Hours",{"$f":"IFERROR(IF(L5=Total_hours,\"Pass\",IF(L5-Total_hours<0.25,\"Pass\",\"Fail\")),\"Fail\")","v":"Fail"},null,null,"Type Signature"]
[null,"Employee e-mail",{"$f":"IFERROR(VLOOKUP($C$4,Source!$B$2:$W993,5,FALSE),\"\")","v":""},null,null,null,null,null,null,null,"Total Normal Hours",{"$f":"ROUND(SUMIF(F12:F2000,Validation!H3,' '!E12:E2000),2)","v":0}]
[null,"Manager",{"$f":"IFERROR(VLOOKUP($C$4,Source!$B$2:$W993,13,FALSE),\"\")","v":""},null,null,null,null,null,null,{"$f":"IF(OR(L6=\"Fail\",L10=\"Fail\",P8=\"Fail\"),\"F\",\"\")","v":"F"},"Total COVID-19 Hours",{"$f":"ROUND(SUMIF(F12:F2001,Validation!H5,' '!E12:E2001),2)","v":0},null,null,"Signed Timesheet",{"$f":"IF(P6=\"\",\"Fail\",\"Pass\")","v":"Fail"}]
[null,null,null,null,null,null,null,null,null,{"$f":"51-Comment","v":0},"Total Other Hours",{"$f":"ROUND(SUMIF(F12:F2002,Validation!H6,' '!E12:E2002),2)","v":0}]
[null,null,null,null,null,null,null,null,null,{"$f":"COUNTIF(K12:K62,\"\")","v":51},"Activity Hours Equal Total Hours",{"$f":"IF(SUM(L7:L9)=Total_hours,\"Pass\",\"Fail\")","v":"Pass"},null,null,"Date Signed",{"$f":"TODAY()","v":"2020-05-07"}]
[null,"Date","Start Time","End Time","Total Time","Activity Type","Task",null,null,"Work Location","Comments",null,"Disaster Related",null,"Instructions"]
[null,null,null,null,{"$f":"(+D12-C12)*24","v":0},null,null,null,null,null,{"$f":"IF(OR(F12=\"COVID-19\",F12=\"Other\"),\"Comment Explaining COVID-19 or Other Activity is Required\",\"\")","v":""},null,null,null,"Note:  If you get a Macro Disabled Notice - Enable Macros "]
[null,null,null,null,0,null,null,null,null,null,{"$f":"IF(OR(F13=\"COVID-19\",F13=\"Other\"),\"Comment Explaining COVID-19 or Other Activity is Required\",\"\")","v":""},null,null,null,"1. Select Week ends date from the drop down menu."]
[null,null,null,null,0,null,null,null,null,null,{"$f":"IF(OR(F14=\"COVID-19\",F14=\"Other\"),\"Comment Explaining COVID-19 or Other Activity is Required\",\"\")","v":""},null,null,null,"2. Type User Name or select from dropdown menu"]
[null,null,null,null,0,null,null,null,null,null,{"$f":"IF(OR(F15=\"COVID-19\",F15=\"Other\"),\"Comment Explaining COVID-19 or Other Activity is Required\",\"\")","v":""},null,null,null,"3. For each day worked, enter DATE worked"]
[null,null,null,null,0,null,null,null,null,null,{"$f":"IF(OR(F16=\"COVID-19\",F16=\"Other\"),\"Comment Explaining COVID-19 or Other Activity is Required\",\"\")","v":""},null,null,null,"4. Enter START TIME and END TIME \nFormat: Hour:Minute AM or PM\nNote if you enter a day prior to the start or after the end dates you will get an error message."]
[null,null,null,null,0,null,null,null,null,null,""]
[null,null,null,null,0,null,null,null,null,null,"",null,null,null,"5. Enter ACTIVITY TYPE and TASK worked and the WORK LOCATION on for said date and time period"]
[null,null,null,null,0,null,null,null,null,null,""]
[null,null,null,null,0,null,null,null,null,null,"",null,null,null,"6. Enter COMMENTS describing the nature of the activity for all COVID-19 and OTHER Activity Types."]
[null,null,null,null,0,null,null,null,null,null,""]
[null,null,null,null,0,null,null,null,null,null,{"$f":"IF(OR(F22=\"COVID-19\",F22=\"Other\"),\"Comment Explaining COVID-19 or Other Activity is Required\",\"\")","v":""},null,null,null,"7. Review timesheet to make sure:\n a.  There are no errors (e.g., # Value or amounts > 8 hours (check AM & PM designations); \n b. cells J6 and J10 are green and read Pass"]
[null,null,null,null,0,null,null,null,null,null,{"$f":"IF(OR(F23=\"COVID-19\",F23=\"Other\"),\"Comment Explaining COVID-19 or Other Activity is Required\",\"\")","v":""}]
[null,null,null,null,0,null,null,null,null,null,""]
[null,null,null,null,0,null,null,null,null,null,"",null,null,null,"8. Press CTRL+s to Save TIMESHEET to your desktop (note this is small \"s\" not capital \"S\") \n"]
[null,null,null,null,0,null,null,null,null,null,"",null,null,null,{"$f":"User_Name&_&WeekEnding&_&\"Daily Save\"","v":"__Daily Save"}]
[null,null,null,null,0,null,null,null,null,null,{"$f":"IF(OR(F27=\"COVID-19\",F27=\"Other\"),\"Comment Explaining COVID-19 or Other Activity is Required\",\"\")","v":""},null,null,null,"                                           At the End of the Week:\n9. Sign the TIMESHEET (after reviewing the certification) by typing your name in cell N6."]
[null,null,null,null,0,null,null,null,null,null,""]
[null,null,null,null,0,null,null,null,null,null,"",null,null,null,"10. Press CTR +e to Execute and Submit TIMESHEET (note this is small \"e\" not capital \"E\")"]
[null,null,null,null,0,null,null,null,null,null,{"$f":"IF(OR(F30=\"COVID-19\",F30=\"Other\"),\"Comment Explaining COVID-19 or Other Activity is Required\",\"\")","v":""},null,null,null,{"$f":"IF(+PassFail=\"F\",(PassFail&_&User_Name&_&WeekEnding&_&\"TH\"&_&Total_hours&_&\"NH\"&_&Normal_Hrs&_&\"C19H\"&_&COVID19Hrs&_&\"OH\"&_&OtherHrs&_&\"C\"&_&J9&_&+L6&_&L10&_&P8&_&Validation!M10&_&Validation!M17&_),(User_Name&_&WeekEnding&_&\"TH\"&_&Total_hours&_&\"NH\"&_&Normal_Hrs&_&\"C19H\"&_&COVID19Hrs&_&\"OH\"&_&OtherHrs&_&\"C\"&_&J9&_&+L6&_&L10&_&P8&_&Validation!M10&_&Validation!M17&_))","v":"F___TH_0_NH_0_C19H_0_OH_0_C_0_Fail_Pass_Fail_0_0_"}]
{"$rows_left_out":33}
{"sheet":"Validation","index":1,"n_rows":878,"n_cols":15,"rows_kept":878,"cut":false,"hidden":true,"merged":[[0,1,0,5]]}
[null,"NOTE ROW 3 IS TEST ROW & HIDDEN",null,null,null,null,14,15,16,17,18,null,{"$f":"+' '!$L$4","v":0},{"$f":"+M1=M2","v":true},"_"]
[null,"Week Ending","Holiday Week","Normal Week Expected Total Hours","Holiday Week Expected Total Hours","Column1",null,"Activity Type",null,"Activity Name","Work Location","_",{"$f":"ROUND(SUM(M4:M20),2)","v":0}]
[null,null,null,38,30.4,null,null,"Normal Assigned Duties","a","COVID-19","Onsite","a"]
[null,null,null,20,16,null,null,"Normal Assigned Duties","a","COVID-19","Onsite","a",{"$f":"ROUND(SUMIF(' '!$G$12:$G$62,Validation!J4,' '!$E$12:$E$62),2)","v":0}]
[null,"2020-03-07","No",40,32,null,null,"COVID-19","b","Curriculum work","Work from home","b",{"$f":"ROUND(SUMIF(' '!$G$12:$G$62,Validation!J5,' '!$E$12:$E$62),2)","v":0}]
[null,{"$f":"+B5+7","v":"2020-03-14"},"No",32.5,26,null,null,"Other","c","Drivers: wash bus","Transportation","c",{"$f":"ROUND(SUMIF(' '!$G$12:$G$62,Validation!J6,' '!$E$12:$E$62),2)","v":0}]
[null,{"$f":"+B6+7","v":"2020-03-21"},"No",40,32,null,null,null,"d","Email","Leave Submitted","d",{"$f":"ROUND(SUMIF(' '!$G$12:$G$62,Validation!J7,' '!$E$12:$E$62),2)","v":0}]
[null,"2020-03-28","No",20,16,null,null,null,"e","Food Service",null,"e",{"$f":"ROUND(SUMIF(' '!$G$12:$G$62,Validation!J8,' '!$E$12:$E$62),2)","v":0}]
[null,"2020-04-04","No",38,30.4,null,null,null,"f","Grading",null,"f",{"$f":"ROUND(SUMIF(' '!$G$12:$G$62,Validation!J9,' '!$E$12:$E$62),2)","v":0}]
[null,"2020-04-11","Yes",40,32,null,null,null,"g","Leave submitted",null,"g",{"$f":"ROUND(SUMIF(' '!$G$12:$G$62,Validation!J10,' '!$E$12:$E$62),2)","v":0}]
[null,"2020-04-18","No",40,32,null,null,null,"h","Lunch/Break",null,"h",{"$f":"ROUND(SUMIF(' '!$G$12:$G$62,Validation!J11,' '!$E$12:$E$62),2)","v":0}]
[null,"2020-04-25","No",40,32,null,null,null,"i","Meeting Other",null,"i",{"$f":"ROUND(SUMIF(' '!$G$12:$G$62,Validation!J12,' '!$E$12:$E$62),2)","v":0}]
[null,"2020-05-02","No",40,32,null,null,null,"j","Other",null,"j",{"$f":"ROUND(SUMIF(' '!$G$12:$G$62,Validation!J13,' '!$E$12:$E$62),2)","v":0}]
[null,"2020-05-09","No",30,24,null,null,null,"k","Phone Call(s)",null,"k",{"$f":"ROUND(SUMIF(' '!$G$12:$G$62,Validation!J14,' '!$E$12:$E$62),2)","v":0}]
[null,"2020-05-16","No",38,30.4,null,null,null,"l","Pick up materials at school",null,"l",{"$f":"ROUND(SUMIF(' '!$G$12:$G$62,Validation!J15,' '!$E$12:$E$62),2)","v":0}]
[null,"2020-05-23","No",35,28,null,null,null,"m","Planning",null,"m",{"$f":"ROUND(SUMIF(' '!$G$12:$G$62,Validation!J16,' '!$E$12:$E$62),2)","v":0}]
[null,"2020-05-30","Yes",40,32,null,null,null,"n","Professional Development",null,"n",{"$f":"ROUND(SUMIF(' '!$G$12:$G$62,Validation!J17,' '!$E$12:$E$62),2)","v":0}]
[null,"2020-06-06","No",25,20,null,null,null,"o","Scanning",null,"o",{"$f":"ROUND(SUMIF(' '!$G$12:$G$62,Validation!J18,' '!$E$12:$E$62),2)","v":0}]
[null,"2020-06-13","No",37,29.6,null,null,null,"p","Skyward",null,"p",{"$f":"ROUND(SUMIF(' '!$G$12:$G$62,Validation!J19,' '!$E$12:$E$62),2)","v":0}]
[null,"2020-06-20","No",40,32,null,null,null,"q","Tech Services",null,"q",{"$f":"ROUND(SUMIF(' '!$G$12:$G$62,Validation!J20,' '!$E$12:$E$62),2)","v":0}]
[null,"2020-06-27","No",38,30.4]
[null,"2020-07-04","Yes",35,28]
[null,"2020-07-11","No",38,30.4]
[null,"2020-07-18","No",40,32]
[null,"2020-07-25","No",38,30.4]
[null,"2020-08-01","No",40,32]
[null,"2020-08-08","No",40,32]
[null,"2020-08-15","No",38,30.4]
[null,"2020-08-22","No",40,32]
[null,"2020-08-29","No",38,30.4]
{"$rows_left_out":849}
{"sheet":"Source","index":2,"n_rows":879,"n_cols":23,"rows_kept":879,"cut":false,"hidden":false,"merged":[]}
["Nalphakey","User Name","First Name","Middle Name","Last Name","E-mail Address","Emp Type Code","Employee Type Description","Building Code","Building Code Desc","Position Plan","Position Assignment Desc","Position Description","Position Supervisor Name","Position Supervisor Namekey","Full Name","Full Name","Position Hours Per Day","Position Start Date","Position End Date","Position Group Desc","Expected Regular","Expected Holiday"]
["MCFARANN000","A00474","ANNE","G","MCFARLAND","Anne.Mcfarland@SUMTER.K12.FL.US","256","Ins 198 Days","0171","SOUTH SUMTER HI","19-20 Active Plan","TEACHER  LANG AR-SH","CLASS SIZE TEACHER","MCKINNEY CHRISTINA JOHNSON","MCKINCHR001","MCFARLAND, ANNE G","ANNE G MCFARLAND","7:36","08/02/2019","06/02/2020","INSTRUCTIONAL",{"$f":"+R2*24*5","v":38},{"$f":"+R2*24*4","v":30.4}]
["JACKSANN000","A01220","ANNETTE","LEVERN","JACKSON","annette.jackson@sumter.k12.fl.us","358","Non 186 Days","9004","TRANSPORTATION","19-20 Active Plan","BUS DRIVER","BUS DRIVER","FOOTE MICHAEL T","FOOTEMIC000","JACKSON, ANNETTE LEVERN","ANNETTE LEVERN JACKSON","4:00","08/12/2019","05/29/2020","CLASSIFIED",20,16]
["WELLSALI000","A01574","ALICE","A","WELLS","alice.wells@sumter.k12.fl.us","357","Non 188 Days","0031","BUSHNELL ELEMEN","19-20 Active Plan","FOOD SER WORKER","FOOD SERVICE","GOODWIN KELLY MARGARET","GOODWKEL000","WELLS, ALICE A","ALICE A WELLS","8:00","08/09/2019","06/01/2020","CLASSIFIED",40,32]
["HARRIARV000","A01628","ARVIS","D","HARRISON","arvis.harrison@sumter.k12.fl.us","358","Non 186 Days","9004","TRANSPORTATION","19-20 Active Plan","BUS DRIVER","BUS DRIVER","FOOTE MICHAEL T","FOOTEMIC000","HARRISON, ARVIS D","ARVIS D HARRISON","6:30","08/12/2019","05/29/2020","CLASSIFIED",32.5,26]
["JONESANI000","A01991","ANITA","G","JONES","Anita.Jones@SUMTER.K12.FL.US","372","Non 220A Days","9006","TECHNOLOGY DEPT","19-20 Active Plan","TECH  IT","TECHNICIAN TECH SUPPORT","TRICK DAVID E","TRICKDAV000","JONES, ANITA G","ANITA G JONES","8:00","07/12/2019","06/12/2020","CLASSIFIED",40,32]
["WILLIAND000","A02330","ANDREA","TAMARA","WILLIAMS","andrea.williams@sumter.k12.fl.us","358","Non 186 Days","9004","TRANSPORTATION","19-20 Active Plan","BUS DRIVER","BUS DRIVER","FOOTE MICHAEL T","FOOTEMIC000","WILLIAMS, ANDREA TAMARA","ANDREA TAMARA WILLIAMS","4:00","08/12/2019","05/29/2020","CLASSIFIED",20,16]
["BROOKANI000","A02353","ANITA","VONSHEA","BROOKS","Anita.Brooks@Sumter.k12.fl.us","256","Ins 198 Days","0102","WILDWOOD ELEMEN","19-20 Active Plan","TEACHER  THIRD","GENERAL FUND TEACHER","TEMPLE JOHN P","TEMPLJOH000","BROOKS, ANITA VONSHEA","ANITA VONSHEA BROOKS","7:36","08/02/2019","06/02/2020","INSTRUCTIONAL",38,30.4]
["NOWICAMY000","A02542","AMY","RENEE","NOWICKI","Amy.Nowicki@SUMTER.K12.FL.US","451","Con 250 Days","0031","BUSHNELL ELEMEN","19-20 Active Plan","SEC  SCH","SECRETARY SCHOOL","GOODWIN KELLY MARGARET","GOODWKEL000","NOWICKI, AMY RENEE","AMY RENEE NOWICKI","8:00","07/01/2019","06/30/2020","CONFIDENTIAL/CLASSIFIED",40,32]
["GARCIANA000","A02583","ANA BELIA","FAVELA","GARCIA","anabelia.garcia@sumter.k12.fl.us","357","Non 188 Days","0042","SOUTH SUMTER MI","19-20 Active Plan","FOOD SER WORKER","FOOD SERVICE","SUBER WILLIAM ERIC","SUBERWIL000","GARCIA, ANA BELIA FAVELA","ANA BELIA FAVELA GARCIA","8:00","10/01/2019","06/01/2020","CLASSIFIED",40,32]
["PERSIANG000","A02643","ANGILA","K","PERSICO","Angila.Persico@SUMTER.K12.FL.US","253","Ins 218 Days","0161","WILDWOOD M/H","19-20 Active Plan","STAFFING SPEC","STAFFING SPECIALIST","GRAYBEAL JERRY DUANE","GRAYBJER000","PERSICO, ANGILA K","ANGILA K PERSICO","8:00","07/19/2019","06/16/2020","INSTRUCTIONAL",40,32]
["RESENANT000","A02726","ANTONIA",null,"RESENDIZ","antonia.resendiz@sumter.k12.fl.us","351","Non 250 Days","0042","SOUTH SUMTER MI","19-20 Active Plan","CUSTODIAN","CUSTODIAN","CAMP JOEL S","CAMP JOE000","RESENDIZ, ANTONIA","ANTONIA RESENDIZ","8:00","07/01/2019","06/30/2020","CLASSIFIED",40,32]
["TONERANN000","A02747","ANNA",null,"TONER","Anna.Toner@sumter.k12.fl.us","351","Non 250 Days","0171","SOUTH SUMTER HI","19-20 Active Plan","CUSTODIAN","CUSTODIAN","MCKINNEY CHRISTINA JOHNSON","MCKINCHR001","TONER, ANNA","ANNA TONER","6:00","07/01/2019","06/30/2020","CLASSIFIED",30,24]
["ASHLEALL000","A03232","ALLEN","J","ASHLEY","Allen.Ashley@SUMTER.K12.FL.US","256","Ins 198 Days","0181","LAKE PANASOFFKE","19-20 Active Plan","TEACHER COMBIN-ELEMENTARY","CLASS SIZE TEACHER","WADE NICOLE LYNN","WADE NIC000","ASHLEY, ALLEN J","ALLEN J ASHLEY","7:36","08/02/2019","06/02/2020","INSTRUCTIONAL",38,30.4]
["AKINSAMA000","A03274","AMANDA","W","AKINS","Amanda.Akins@SUMTER.K12.FL.US","370","Non 186 Days","0031","BUSHNELL ELEMEN","19-20 Active Plan","PARAPROFESSIONAL  TTL I-E","TITLE I PARA","GOODWIN KELLY MARGARET","GOODWKEL000","AKINS, AMANDA W","AMANDA W AKINS","7:00","10/14/2019","05/29/2020","CLASSIFIED",35,28]
["NORRIAPR000","A03292","APRIL","MAY","NORRIS","APRIL.NORRIS@SUMTER.K12.FL.US","351","Non 250 Days","9001","COUNTY OFFICE","19-20 Active Plan","ACCOUNT CLERK","TECHNICIAN PAYROLL","SMITH DEBORAH WALTERS","SMITHDEB000","NORRIS, APRIL MAY","APRIL MAY NORRIS","8:00","07/01/2019","06/30/2020","CLASSIFIED",40,32]
["BROWNANN000","A03339","ANNETTE","C","BROWN","annette.brown@sumter.k12.fl.us","358","Non 186 Days","9004","TRANSPORTATION","19-20 Active Plan","BUS DRIVER","BUS DRIVER","FOOTE MICHAEL T","FOOTEMIC000","BROWN, ANNETTE C","ANNETTE C BROWN","5:00","01/08/2020","05/29/2020","CLASSIFIED",25,20]
["FUSSEALI000","A03487","ALICIA","DAWN LISCOME","FUSSELL","alicia.fussell@sumter.k12.fl.us","370","Non 186 Days","0171","SOUTH SUMTER HI","19-20 Active Plan","LAB ASSISTANT","VIRTUAL LAB ASSISTANT","MCKINNEY CHRISTINA JOHNSON","MCKINCHR001","FUSSELL, ALICIA DAWN LISCOME","ALICIA DAWN LISCOME FUSSELL","7:24","08/12/2019","05/29/2020","CLASSIFIED",37,29.6]
["HAMILANG000","A03493","ANGELA","MICHELLE","HAMILTON","Angela.Hamilton@SUMTER.K12.FL.US","372","Non 220A Days","9006","TECHNOLOGY DEPT","19-20 Active Plan","TECH  IT","TECHNICIAN TECH SUPPORT","TRICK DAVID E","TRICKDAV000","HAMILTON, ANGELA MICHELLE","ANGELA MICHELLE HAMILTON","8:00","07/12/2019","06/12/2020","CLASSIFIED",40,32]
["RIVERALI000","A03562","ALIMAYU","B","RIVERS","Alimayu.Rivers@SUMTER.K12.FL.US","256","Ins 198 Days","0161","WILDWOOD M/H","19-20 Active Plan","TEACHER  VE","ESE TEACHER","GRAYBEAL JERRY DUANE","GRAYBJER000","RIVERS, ALIMAYU B","ALIMAYU B RIVERS","7:36","08/02/2019","06/02/2020","INSTRUCTIONAL",38,30.4]
["PLUNKANT000","A03647","ANTONIA","OMBAO","PLUNKETT","Antonia.Plunkett@SUMTER.K12.FL.US","370","Non 186 Days","0051","WEBSTER ELEMENT","19-20 Active Plan","PARAPROFESSIONAL  TTL I-E","TITLE I PARA","SHEA MELYNDA BROOKE","SHEA MEL000","PLUNKETT, ANTONIA OMBAO","ANTONIA OMBAO PLUNKETT","7:00","08/12/2019","05/29/2020","CLASSIFIED",35,28]
["FUSSEAMY000","A03699","AMY","KATHRYN","FUSSELL","Amy.Fussell@Sumter.k12.fl.us","256","Ins 198 Days","0171","SOUTH SUMTER HI","19-20 Active Plan","LIB/MED SPEC-SH","MEDIA SPECIALIST","MCKINNEY CHRISTINA JOHNSON","MCKINCHR001","FUSSELL, AMY KATHRYN","AMY KATHRYN FUSSELL","7:36","08/02/2019","06/02/2020","INSTRUCTIONAL",38,30.4]
["UGUR AYS000","A03730","AYSEGUL",null,"UGUR","Aysegul.Ugur@SUMTER.K12.FL.US","762","212 A Intern","0161","WILDWOOD M/H","19-20 Active Plan","ADMIN ASST  SCH","INTERN","GRAYBEAL JERRY DUANE","GRAYBJER000","UGUR, AYSEGUL","AYSEGUL UGUR","8:00","07/25/2019","06/12/2020","INTERN",40,32]
["BRYANANT000","A03740","ANTHONY",null,"BRYANT","Anthony.Bryant@SUMTER.K12.FL.US","256","Ins 198 Days","0171","SOUTH SUMTER HI","19-20 Active Plan","TEACHER  MATH-SH","CLASS SIZE TEACHER","MCKINNEY CHRISTINA JOHNSON","MCKINCHR001","BRYANT, ANTHONY","ANTHONY BRYANT","7:36","08/02/2019","06/02/2020","INSTRUCTIONAL",38,30.4]
["WINTEALI000","A03770","ALISCHA","KAYE","WINTER","alischa.winter@sumter.k12.fl.us","371","Non 196 Days","0051","WEBSTER ELEMENT","19-20 Active Plan","PARAPROFESSIONAL  PK","TITLE I/ PRE K LEAD","SHEA MELYNDA BROOKE","SHEA MEL000","WINTER, ALISCHA KAYE","ALISCHA KAYE WINTER","8:00","08/02/2019","06/02/2020","CLASSIFIED",40,32]
["VAUGHASH000","A03836","ASHLEY","HIAL","VAUGHAN","Ashley.Vaughan@SUMTER.K12.FL.US","651","CNU 250 Days","9001","COUNTY OFFICE","19-20 Active Plan","ADMIN ASST  FISCAL","FINANCE ASSISTANT","SMITH DEBORAH WALTERS","SMITHDEB000","VAUGHAN, ASHLEY HIAL","ASHLEY HIAL VAUGHAN","8:00","07/01/2019","06/30/2020","NON-INSTRUCT NO BARGAINING UNI",40,32]
["NAVE ALL000","A03869","ALLISON","CAMPBELL","NAVE","Allison.Nave@SUMTER.K12.FL.US","275","Ins 202 Days","0051","WEBSTER ELEMENT","19-20 Active Plan","COUNSELOR-E","COUNSELOR","SHEA MELYNDA BROOKE","SHEA MEL000","NAVE, ALLISON CAMPBELL","ALLISON CAMPBELL NAVE","7:36","08/06/2019","06/04/2020","INSTRUCTIONAL",38,30.4]
["FIELDANG000","A03901","ANGELINE","ELETHER","FIELD","Angel.Field@Sumter.k12.fl.us","451","Con 250 Days","0042","SOUTH SUMTER MI","19-20 Active Plan","SEC  SCH","SECRETARY SCHOOL","CAMP JOEL S","CAMP JOE000","FIELD, ANGELINE ELETHER","ANGELINE ELETHER FIELD","8:00","07/01/2019","06/30/2020","CONFIDENTIAL/CLASSIFIED",40,32]
["FORT ASH000","A03986","ASHLEY","NICOLE","FORT","Ashley.Fort@Sumter.k12.fl.us","275","Ins 202 Days","0031","BUSHNELL ELEMEN","19-20 Active Plan","COUNSELOR-E","COUNSELOR","GOODWIN KELLY MARGARET","GOODWKEL000","FORT, ASHLEY NICOLE","ASHLEY NICOLE FORT","7:36","07/31/2019","06/04/2020","INSTRUCTIONAL",38,30.4]
["NELSOANA000","A04023","ANA","CRISTINA","NELSON","Ana.Nelson@SUMTER.K12.FL.US","256","Ins 198 Days","3001","SUMTER PREP","19-20 Active Plan","TEACHER  LANG AR-SH","SAI TEACHER","PRESLEY JAMES CHESTER","PRESLJAM000","NELSON, ANA CRISTINA","ANA CRISTINA NELSON","7:36","10/21/2019","06/02/2020","INSTRUCTIONAL",38,30.4]
{"$rows_left_out":849}